Target
Hydroxycarboxylic acid receptor 2
Ligand
BDBM50342421
Substrate
Meas. Tech.
ChEMBL_744532 (CHEMBL1772553)
Ki
2500±n/a nM
Citation
 van Veldhoven, JPBlad, CCArtsen, CMKlopman, CWolfram, DRAbdelkadir, MJLane, JRBrussee, JIjzerman, AP Structure-activity relationships of trans-substituted-propenoic acid derivatives on the nicotinic acid receptor HCA2 (GPR109A). Bioorg Med Chem Lett 21:2736-9 (2011)  
Target
Name:
Hydroxycarboxylic acid receptor 2
Synonyms:
G-protein coupled receptor 109A GPR109A HCAR2 HM74A NIACR1 Nicotinic acid receptor 1
Type:
G Protein-Coupled Receptor (GPCR)
Mol. Mass.:
41868.22
Organism:
Homo sapiens (Human)
Description:
Membranes from CHO cells expressing the recombinant human GPR109A were used in competition binding assay.
Residue:
363
  
Inhibitor
Name:
BDBM50342421
Synonyms:
CHEMBL1771642 | Hexyl fumarate
Type:
Small organic molecule
Emp. Form.:
C10H16O4
Mol. Mass.:
200.2316
SMILES:
CCCCCCOC(=O)\C=C\C(O)=O
: