Target
Calcitonin gene-related peptide type 1 receptor
Ligand
BDBM50342626
Substrate
Meas. Tech.
ChEMBL_745045 (CHEMBL1772121)
Ki
0.61±n/a nM
Citation
 Paone, DVNguyen, DNShaw, AWBurgey, CSPotteiger, CMDeng, JZMosser, SDSalvatore, CAYu, SRoller, SKane, SASelnick, HGVacca, JPWilliams, TM Orally bioavailable imidazoazepanes as calcitonin gene-related peptide (CGRP) receptor antagonists: discovery of MK-2918. Bioorg Med Chem Lett 21:2683-6 (2011)  
Target
Name:
Calcitonin gene-related peptide type 1 receptor
Synonyms:
Adrenomedullin receptor AM1; CALCRL/RAMP2 CALRL_HUMAN CGRP type 1 receptor mRNA Calcitonin gene-related peptide (CGRP) receptor Calcitonin receptor-like receptor Human CL receptor
Type:
Enzyme Catalytic Domain
Mol. Mass.:
52980.45
Organism:
Homo sapiens (Human)
Description:
Q16602
Residue:
461
  
Inhibitor
Name:
BDBM50342626
Synonyms:
CHEMBL1770716 | N-((6S,9R)-6-(2,3-difluorophenyl)-3-(2,2,2-trifluoroethyl)-6,7,8,9-tetrahydro-5H-imidazo[1,2-a]azepin-9-yl)-2'-oxo-1',2'-dihydrospiro[piperidine-4,3'-pyrrolo[2,3-b]pyridine]-1-carboxamide
Type:
Small organic molecule
Emp. Form.:
C28H27F5N6O2
Mol. Mass.:
574.545
SMILES:
Fc1cccc([C@@H]2CC[C@@H](NC(=O)N3CCC4(CC3)C(=O)Nc3ncccc43)c3ncc(CC(F)(F)F)n3C2)c1F
: