Target
Acid-sensing ion channel 3
Ligand
BDBM50342659
Substrate
Meas. Tech.
ChEMBL_745055 (CHEMBL1772131)
IC50
6900±n/a nM
Citation
 Wolkenberg, SEZhao, ZMulhearn, JJHarrison, STSanders, JMCato, MJJovanovska, APanigel, JCook, SPHenze, DAKane, SAHartman, GDBarrow, JC High concentration electrophysiology-based fragment screen: discovery of novel acid-sensing ion channel 3 (ASIC3) inhibitors. Bioorg Med Chem Lett 21:2646-9 (2011)  
Target
Name:
Acid-sensing ion channel 3
Synonyms:
ACCN3 ASIC3_HUMAN SLNAC1 | TNAC1
Type:
PROTEIN
Mol. Mass.:
58910.26
Organism:
Homo sapiens (Human)
Description:
ChEMBL_757561
Residue:
531
  
Inhibitor
Name:
BDBM50342659
Synonyms:
2-phenylpyridin-4-amine | CHEMBL1770738
Type:
Small organic molecule
Emp. Form.:
C11H10N2
Mol. Mass.:
170.2105
SMILES:
Nc1ccnc(c1)-c1ccccc1
: