Target
Sucrase-isomaltase, intestinal
Ligand
BDBM50330955
Substrate
Meas. Tech.
ChEMBL_744252 (CHEMBL1772059)
IC50
1300±n/a nM
Citation
 Tanabe, GOtani, TCong, WMinematsu, TNinomiya, KYoshikawa, MMuraoka, O Biological evaluation of 3'-O-alkylated analogs of salacinol, the role of hydrophobic alkyl group at 3' position in the side chain on thea-glucosidase inhibitory activity. Bioorg Med Chem Lett 21:3159-62 (2011)  
Target
Name:
Sucrase-isomaltase, intestinal
Synonyms:
SUIS_RAT Sucrase-isomaltase | alpha-Glucosidase (α-Glucosidase)
Type:
Enzyme
Mol. Mass.:
210329.04
Organism:
Rattus norvegicus (Rat)
Description:
P23739
Residue:
1841
  
Inhibitor
Name:
BDBM50330955
Synonyms:
(1S,2S)-3-[(2R,3S,4S)-3,4-dihydroxy-2-(hydroxymethyl)tetrahydrothiophenium-1-yl]-2-hydroxy-1-(hydroxymethyl)propyl sulfate CHEMBL1208974 | salacinol
Type:
Small organic molecule
Emp. Form.:
C9H18O9S2
Mol. Mass.:
334.364
SMILES:
OC[C@H](OS([O-])(=O)=O)[C@H](O)C[S@@+]1C[C@@H](O)[C@H](O)[C@H]1CO
: