Target
Interstitial collagenase
Ligand
BDBM50343083
Substrate
Meas. Tech.
ChEMBL_744949 (CHEMBL1771908)
Ki
>10000±n/a nM
Citation
 Barta, TEBecker, DPBedell, LJEaston, AMHockerman, SLKiefer, JMunie, GEMathis, KJLi, MHRico, JGVillamil, CIWilliams, JM MMP-13 selectivea-sulfone hydroxamates: a survey of P1' heterocyclic amide isosteres. Bioorg Med Chem Lett 21:2820-2 (2011)  
Target
Name:
Interstitial collagenase
Synonyms:
CLG MMP1 Matrix metalloproteinase-1 | Matrix metalloproteinase-1 (MMP-1)
Type:
Enzyme
Mol. Mass.:
54010.26
Organism:
Homo sapiens (Human)
Description:
P03956
Residue:
469
  
Inhibitor
Name:
BDBM50343083
Synonyms:
CHEMBL1771218 | N-hydroxy-4-(4-(3-(5-(5-methylpyridin-2-yl)-1H-tetrazol-1-yl)propoxy)phenylsulfonyl)tetrahydro-2H-pyran-4-carboxamide
Type:
Small organic molecule
Emp. Form.:
C22H26N6O6S
Mol. Mass.:
502.543
SMILES:
Cc1ccc(nc1)-c1nnnn1CCCOc1ccc(cc1)S(=O)(=O)C1(CCOCC1)C(=O)NO
: