Target
Albumin
Ligand
BDBM50343352
Substrate
Meas. Tech.
ChEMBL_746850 (CHEMBL1777133)
Kd
2E4±n/a nM
Citation
 Giannetti, AMWong, HDijkgraaf, GJDueber, ECOrtwine, DFBravo, BJGould, SEPlise, EGLum, BLMalhi, VGraham, RA Identification, characterization, and implications of species-dependent plasma protein binding for the oral Hedgehog pathway inhibitor vismodegib (GDC-0449). J Med Chem 54:2592-601 (2011)  
Target
Name:
Albumin
Synonyms:
ALBU_RAT Serum albumin
Type:
PROTEIN
Mol. Mass.:
68729.59
Organism:
Rattus norvegicus
Description:
ChEMBL_1486769
Residue:
608
  
Inhibitor
Name:
BDBM50343352
Synonyms:
2-hydroxy-3-(3-oxo-1-phenylbutyl)-4H-chromen-4-one 4-Hydroxy-3-(3-oxo-1-phenyl-butyl)-chromen-2-one CHEMBL1464 Jantoven wafarin warfarine
Type:
Small organic molecule
Emp. Form.:
C19H16O4
Mol. Mass.:
308.3279
SMILES:
CC(=O)CC(c1ccccc1)c1c(O)c2ccccc2oc1=O
: