Target
Signal transducer and activator of transcription 3
Ligand
BDBM50343632
Substrate
Meas. Tech.
ChEMBL_746882 (CHEMBL1777216)
Ki
43±n/a nM
Citation
 Mandal, PKGao, FLu, ZRen, ZRamesh, RBirtwistle, JSKaluarachchi, KKChen, XBast, RCLiao, WSMcMurray, JS Potent and selective phosphopeptide mimetic prodrugs targeted to the Src homology 2 (SH2) domain of signal transducer and activator of transcription 3. J Med Chem 54:3549-63 (2011)  
Target
Name:
Signal transducer and activator of transcription 3
Synonyms:
APRF STAT3_HUMAN Signal transducer and activator of transcription 3 (STAT3)
Type:
Protein
Mol. Mass.:
88064.31
Organism:
Homo sapiens (Human)
Description:
P40763
Residue:
770
  
Inhibitor
Name:
BDBM50343632
Synonyms:
4-((E)-4-((S)-1-((1R,2S,5S)-2-((S)-5-amino-1-(benzylamino)-1,5-dioxopentan-2-ylcarbamoyl)-3-azabicyclo[3.1.0]hexan-3-yl)-4-methyl-1-oxopentan-2-ylamino)-4-oxobut-2-en-2-yl)phenyl dihydrogen phosphate | CHEMBL1774955
Type:
Small organic molecule
Emp. Form.:
C34H44N5O9P
Mol. Mass.:
697.715
SMILES:
CC(C)C[C@H](NC(=O)\C=C(/C)c1ccc(OP(O)(O)=O)cc1)C(=O)N1C[C@H]2C[C@H]2[C@H]1C(=O)N[C@@H](CCC(N)=O)C(=O)NCc1ccccc1
: