Target
Signal transducer and activator of transcription 3
Ligand
BDBM50343635
Substrate
Meas. Tech.
ChEMBL_746882 (CHEMBL1777216)
Ki
57±n/a nM
Citation
 Mandal, PKGao, FLu, ZRen, ZRamesh, RBirtwistle, JSKaluarachchi, KKChen, XBast, RCLiao, WSMcMurray, JS Potent and selective phosphopeptide mimetic prodrugs targeted to the Src homology 2 (SH2) domain of signal transducer and activator of transcription 3. J Med Chem 54:3549-63 (2011)  
Target
Name:
Signal transducer and activator of transcription 3
Synonyms:
APRF STAT3_HUMAN Signal transducer and activator of transcription 3 (STAT3)
Type:
Protein
Mol. Mass.:
88064.31
Organism:
Homo sapiens (Human)
Description:
P40763
Residue:
770
  
Inhibitor
Name:
BDBM50343635
Synonyms:
4-((E)-4-((3S,6S)-6-((S)-5-amino-1-(benzylamino)-1,5-dioxopentan-2-ylcarbamoyl)-4-oxo-1,2,3,4,6,7-hexahydroazepino[3,2,1-hi]indol-3-ylamino)-4-oxobut-2-en-2-yl)phenyl dihydrogen phosphate | CHEMBL1774958
Type:
Small organic molecule
Emp. Form.:
C35H38N5O9P
Mol. Mass.:
703.6781
SMILES:
C\C(=C/C(=O)N[C@H]1CCc2cccc3C[C@H](N(c23)C1=O)C(=O)N[C@@H](CCC(N)=O)C(=O)NCc1ccccc1)c1ccc(OP(O)(O)=O)cc1
: