Target
Signal transducer and activator of transcription 3
Ligand
BDBM50343647
Substrate
Meas. Tech.
ChEMBL_746882 (CHEMBL1777216)
Ki
386±n/a nM
Citation
 Mandal, PKGao, FLu, ZRen, ZRamesh, RBirtwistle, JSKaluarachchi, KKChen, XBast, RCLiao, WSMcMurray, JS Potent and selective phosphopeptide mimetic prodrugs targeted to the Src homology 2 (SH2) domain of signal transducer and activator of transcription 3. J Med Chem 54:3549-63 (2011)  
Target
Name:
Signal transducer and activator of transcription 3
Synonyms:
APRF STAT3_HUMAN Signal transducer and activator of transcription 3 (STAT3)
Type:
Protein
Mol. Mass.:
88064.31
Organism:
Homo sapiens (Human)
Description:
P40763
Residue:
770
  
Inhibitor
Name:
BDBM50343647
Synonyms:
4-((E)-4-oxo-4-((3S,6S)-4-oxo-6-(2-ureidoethylcarbamoyl)-1,2,3,4,6,7-hexahydroazepino[3,2,1-hi]indol-3-ylamino)but-2-en-2-yl)phenyl dihydrogen phosphate | CHEMBL1774970
Type:
Small organic molecule
Emp. Form.:
C26H30N5O8P
Mol. Mass.:
571.5189
SMILES:
CC(=CC(=O)N[C@H]1CCc2cccc3C[C@H](N(c23)C1=O)C(=O)NCCNC(N)=O)c1ccc(OP(O)(O)=O)cc1
: