Target
Histamine H3 receptor
Ligand
BDBM50343844
Substrate
Meas. Tech.
ChEMBL_747648 (CHEMBL1777266)
Ki
27±n/a nM
Citation
 Wiecek, MKottke, TLigneau, XSchunack, WSeifert, RStark, HHandzlik, JKiec-Kononowicz, K N-Alkenyl and cycloalkyl carbamates as dual acting histamine H3 and H4 receptor ligands. Bioorg Med Chem 19:2850-8 (2011)  
Target
Name:
Histamine H3 receptor
Synonyms:
G-protein coupled receptor 97 HH3R HRH3 Histamine H3 receptor (H3) Histamine receptor (H3 and H4)
Type:
G Protein-Coupled Receptor (GPCR)
Mol. Mass.:
48691.47
Organism:
Homo sapiens (Human)
Description:
Binding assays were using CHO cells stably expressing hH3R receptors.
Residue:
445
  
Inhibitor
Name:
BDBM50343844
Synonyms:
(E)-3-(1H-Imidazol-4-yl)propylpent-2-enylcarbamate hydrogenmaleate | CHEMBL1774591
Type:
Small organic molecule
Emp. Form.:
C12H19N3O2
Mol. Mass.:
237.2982
SMILES:
CC\C=C\CNC(=O)OCCCc1cnc[nH]1
: