Target
Leukotriene A-4 hydrolase
Ligand
BDBM50343912
Substrate
Meas. Tech.
ChEMBL_747537 (CHEMBL1777071)
IC50
220±n/a nM
Citation
 Chen, ZWu, YLiu, YYang, SChen, YLai, L Discovery of dual target inhibitors against cyclooxygenases and leukotriene A4 hydrolyase. J Med Chem 54:3650-60 (2011)  
Target
Name:
Leukotriene A-4 hydrolase
Synonyms:
LKHA4_HUMAN LTA4 Leukotriene A(4) hydrolase Leukotriene A4 hydrolase
Type:
Hydrolase; metalloprotease
Mol. Mass.:
69280.41
Organism:
Homo sapiens (Human)
Description:
Human recombinant LTA4H.
Residue:
611
  
Inhibitor
Name:
BDBM50343912
Synonyms:
1-(2-(4-(2-(Trifluoromethyl)phenoxy)phenoxy)ethyl)pyrrolidine | CHEMBL1775099
Type:
Small organic molecule
Emp. Form.:
C19H20F3NO2
Mol. Mass.:
351.3628
SMILES:
FC(F)(F)c1ccccc1Oc1ccc(OCCN2CCCC2)cc1
: