Target
Prostaglandin G/H synthase 2
Ligand
BDBM50343912
Substrate
Meas. Tech.
ChEMBL_747538 (CHEMBL1777072)
IC50
5000±n/a nM
Citation
 Chen, ZWu, YLiu, YYang, SChen, YLai, L Discovery of dual target inhibitors against cyclooxygenases and leukotriene A4 hydrolyase. J Med Chem 54:3650-60 (2011)  
Target
Name:
Prostaglandin G/H synthase 2
Synonyms:
COX2 Cyclooxygenase 2 (COX-2) Cyclooxygenase-2 (COX-2 AA) Cyclooxygenase-2 (COX-2) PGH2_HUMAN PHS II Prostaglandin E synthase/G/H synthase 2 Prostaglandin-endoperoxide synthase 2
Type:
Enzyme
Mol. Mass.:
69003.89
Organism:
Homo sapiens (Human)
Description:
Recombinant Cox-2 provided by Cayman (Cayman Chemical Co.,Ann Arbor, MI).
Residue:
604
  
Inhibitor
Name:
BDBM50343912
Synonyms:
1-(2-(4-(2-(Trifluoromethyl)phenoxy)phenoxy)ethyl)pyrrolidine | CHEMBL1775099
Type:
Small organic molecule
Emp. Form.:
C19H20F3NO2
Mol. Mass.:
351.3628
SMILES:
FC(F)(F)c1ccccc1Oc1ccc(OCCN2CCCC2)cc1
: