Target
Leukotriene A-4 hydrolase
Ligand
BDBM50343911
Substrate
Meas. Tech.
ChEMBL_747537 (CHEMBL1777071)
IC50
34000±n/a nM
Citation
 Chen, ZWu, YLiu, YYang, SChen, YLai, L Discovery of dual target inhibitors against cyclooxygenases and leukotriene A4 hydrolyase. J Med Chem 54:3650-60 (2011)  
Target
Name:
Leukotriene A-4 hydrolase
Synonyms:
LKHA4_HUMAN LTA4 Leukotriene A(4) hydrolase Leukotriene A4 hydrolase
Type:
Hydrolase; metalloprotease
Mol. Mass.:
69280.41
Organism:
Homo sapiens (Human)
Description:
Human recombinant LTA4H.
Residue:
611
  
Inhibitor
Name:
BDBM50343911
Synonyms:
3-Nitro-2-(4-(2-(pyrrolidin-1-yl)ethoxy)phenoxy)pyridine | CHEMBL1775098
Type:
Small organic molecule
Emp. Form.:
C17H19N3O4
Mol. Mass.:
329.3505
SMILES:
[O-][N+](=O)c1cccnc1Oc1ccc(OCCN2CCCC2)cc1
: