Target
Cytochrome P450 1B1
Ligand
BDBM50187658
Substrate
Meas. Tech.
ChEMBL_748493 (CHEMBL1780346)
Ki
>2340±n/a nM
Citation
 Androutsopoulos, VPPapakyriakou, AVourloumis, DSpandidos, DA Comparative CYP1A1 and CYP1B1 substrate and inhibitor profile of dietary flavonoids. Bioorg Med Chem 19:2842-9 (2011)  
Target
Name:
Cytochrome P450 1B1
Synonyms:
CP1B1_HUMAN CYPIB1 | Cytochrome P450 1B1 (CYP1B1)
Type:
PROTEIN
Mol. Mass.:
60861.81
Organism:
Homo sapiens (Human)
Description:
ChEMBL_1474523
Residue:
543
  
Inhibitor
Name:
BDBM50187658
Synonyms:
4',5-dihydroxy-7-methoxy flavone 5-hydroxy-2-(4-hydroxyphenyl)-7-methoxy-4H-chromen-4-one CHEMBL210635 genkwanin
Type:
Small organic molecule
Emp. Form.:
C16H12O5
Mol. Mass.:
284.2635
SMILES:
COc1cc(O)c2c(c1)oc(cc2=O)-c1ccc(O)cc1
: