Target
Transient receptor potential cation channel subfamily V member 1
Ligand
BDBM50344377
Substrate
Meas. Tech.
ChEMBL_748631 (CHEMBL1780484)
IC50
4.5±n/a nM
Citation
 Urbahns, KYura, TMogi, MTajimi, MFujishima, HMasuda, TYoshida, NMoriwaki, TLowinger, TBMeier, HChan, FMadge, DGupta, JB Naphthol derivatives as TRPV1 inhibitors for the treatment of urinary incontinence. Bioorg Med Chem Lett 21:3354-7 (2011)  
Target
Name:
Transient receptor potential cation channel subfamily V member 1
Synonyms:
Capsaicin receptor TRPV1_RAT Trpv1 Vanilloid VR1 Vanilloid receptor 1 (VRI/TRPV1) Vanilloid receptor type 1-like (TrpV1/Vr1) Vr1l | osm-9-like TRP channel 1
Type:
Transient Receptor
Mol. Mass.:
94956.12
Organism:
Rattus norvegicus (rat)
Description:
O35433
Residue:
838
  
Inhibitor
Name:
BDBM50344377
Synonyms:
1-(4-chloro-3-(trifluoromethyl)phenyl)-3-(2-chloro-7-hydroxynaphthalen-1-yl)urea | CHEMBL1779839
Type:
Small organic molecule
Emp. Form.:
C18H11Cl2F3N2O2
Mol. Mass.:
415.193
SMILES:
Oc1ccc2ccc(Cl)c(NC(=O)Nc3ccc(Cl)c(c3)C(F)(F)F)c2c1
: