Target
Metabotropic glutamate receptor 5
Ligand
BDBM50344415
Substrate
Meas. Tech.
ChEMBL_748643 (CHEMBL1780496)
EC50
62±n/a nM
Citation
 Sams, AGMikkelsen, GKBrodbeck, RMPu, XRitzén, A Efficacy switching SAR of mGluR5 allosteric modulators: highly potent positive and negative modulators from one chemotype. Bioorg Med Chem Lett 21:3407-10 (2011)  
Target
Name:
Metabotropic glutamate receptor 5
Synonyms:
GPRC1E GRM5_HUMAN metabotropic glutamate 5 | metabotropic glutamate 5a
Type:
Enzyme
Mol. Mass.:
132484.72
Organism:
Homo sapiens (Human)
Description:
Residue:
1212
  
Inhibitor
Name:
BDBM50344415
Synonyms:
CHEMBL1779844 | N-Isopropyl-6-phenylethynyl-nicotinamide
Type:
Small organic molecule
Emp. Form.:
C17H16N2O
Mol. Mass.:
264.3217
SMILES:
CC(C)NC(=O)c1ccc(nc1)C#Cc1ccccc1
: