Target
Cytochrome P450 2C19
Ligand
BDBM50344585
Substrate
Meas. Tech.
ChEMBL_748854 (CHEMBL1780836)
IC50
2700±n/a nM
Citation
 Beaulieu, PLGillard, JJolicoeur, EDuan, JGarneau, MKukolj, GPoupart, MA From benzimidazole to indole-5-carboxamide Thumb Pocket I inhibitors of HCV NS5B polymerase. Part 1: indole C-2 SAR and discovery of diamide derivatives with nanomolar potency in cell-based subgenomic replicons. Bioorg Med Chem Lett 21:3658-63 (2011)  
Target
Name:
Cytochrome P450 2C19
Synonyms:
(R)-limonene 6-monooxygenase (S)-limonene 7-monooxygenase CYP2C19 CYPIIC19 Cytochrome P450 2C19 [I331V] Cytochrome P450-254C Mephenytoin 4-hydroxylase P450-254C
Type:
Enzyme
Mol. Mass.:
55935.47
Organism:
Homo sapiens (Human)
Description:
P33261
Residue:
490
  
Inhibitor
Name:
BDBM50344585
Synonyms:
3-(4-(2-(3-cyclohexyl-1-methyl-2-(pyridin-2-yl)-1H-indole-6-carboxamido)-2-methylpropanamido)phenyl)acrylic acid | CHEMBL1778481
Type:
Small organic molecule
Emp. Form.:
C34H36N4O4
Mol. Mass.:
564.674
SMILES:
Cn1c(c(C2CCCCC2)c2ccc(cc12)C(=O)NC(C)(C)C(=O)Nc1ccc(\C=C\C(O)=O)cc1)-c1ccccn1
: