Target
Serine/threonine-protein kinase pim-2
Ligand
BDBM50345240
Substrate
Meas. Tech.
ChEMBL_752074 (CHEMBL1786238)
IC50
1200±n/a nM
Citation
 Xiang, YHirth, BAsmussen, GBiemann, HPBishop, KAGood, AFitzgerald, MGladysheva, TJain, AJancsics, KLiu, JMetz, MPapoulis, ASkerlj, RStepp, JDWei, RR The discovery of novel benzofuran-2-carboxylic acids as potent Pim-1 inhibitors. Bioorg Med Chem Lett 21:3050-6 (2011)  
Target
Name:
Serine/threonine-protein kinase pim-2
Synonyms:
PIM2 Pim-2h Serine/threonine-protein kinase PIM | Serine/threonine-protein kinase pim-2 (PIM2)
Type:
Serine/threonine-protein kinase
Mol. Mass.:
34185.93
Organism:
Homo sapiens (Human)
Description:
Q9P1W9
Residue:
311
  
Inhibitor
Name:
BDBM50345240
Synonyms:
5-(4-(4-aminobutylamino)pyrimidin-2-yl)benzofuran-2-carboxylic acid | CHEMBL1782511
Type:
Small organic molecule
Emp. Form.:
C17H18N4O3
Mol. Mass.:
326.3498
SMILES:
NCCCCNc1ccnc(n1)-c1ccc2oc(cc2c1)C(O)=O
: