Target
Macrophage-stimulating protein receptor
Ligand
BDBM50345444
Substrate
Meas. Tech.
ChEMBL_752094 (CHEMBL1786258)
IC50
>10000±n/a nM
Citation
 Chen, ZWang, XZhu, WCao, XTong, LLi, HXie, HXu, YTan, SKuang, DDing, JQian, X Acenaphtho[1,2-b]pyrrole-based selective fibroblast growth factor receptors 1 (FGFR1) inhibitors: design, synthesis, and biological activity. J Med Chem 54:3732-45 (2011)  
Target
Name:
Macrophage-stimulating protein receptor
Synonyms:
2.7.10.1 CDw136 MST1R Macrophage-stimulating protein receptor alpha chain PTK8 RON Tyrosine kinase receptor ron | p185-Ron
Type:
Protein
Mol. Mass.:
152270.76
Organism:
Homo sapiens (Human)
Description:
Q04912
Residue:
1400
  
Inhibitor
Name:
BDBM50345444
Synonyms:
CHEMBL1784725 | Ethyl 8-oxo-8H-acenaphtho[1,2-b]pyrrole-9-carboxylate
Type:
Small organic molecule
Emp. Form.:
C17H11NO3
Mol. Mass.:
277.2741
SMILES:
CCOC(=O)c1c2c3cccc4cccc(c2nc1=O)c34
: