Target
Vascular endothelial growth factor receptor 1
Ligand
BDBM50345444
Substrate
Meas. Tech.
ChEMBL_751990 (CHEMBL1786061)
IC50
3200±n/a nM
Citation
 Chen, ZWang, XZhu, WCao, XTong, LLi, HXie, HXu, YTan, SKuang, DDing, JQian, X Acenaphtho[1,2-b]pyrrole-based selective fibroblast growth factor receptors 1 (FGFR1) inhibitors: design, synthesis, and biological activity. J Med Chem 54:3732-45 (2011)  
Target
Name:
Vascular endothelial growth factor receptor 1
Synonyms:
FLT FRT Fms-like tyrosine kinase 1 Tyrosine-protein kinase FRT VEGFR-1 VGFR1_HUMAN Vascular endothelial growth factor receptor 1 (FLT1) Vascular endothelial growth factor receptor 1 and 2 (Flt-1 and KDR) Vascular permeability factor receptor vascular endothelial growth factor/vascular permeability factor receptor
Type:
Receptor Tyrosine Kinase
Mol. Mass.:
150800.23
Organism:
Homo sapiens (Human)
Description:
P17948
Residue:
1338
  
Inhibitor
Name:
BDBM50345444
Synonyms:
CHEMBL1784725 | Ethyl 8-oxo-8H-acenaphtho[1,2-b]pyrrole-9-carboxylate
Type:
Small organic molecule
Emp. Form.:
C17H11NO3
Mol. Mass.:
277.2741
SMILES:
CCOC(=O)c1c2c3cccc4cccc(c2nc1=O)c34
: