Target
Vascular endothelial growth factor receptor 2
Ligand
BDBM50345444
Substrate
Meas. Tech.
ChEMBL_751991 (CHEMBL1786062)
IC50
>10000±n/a nM
Citation
 Chen, ZWang, XZhu, WCao, XTong, LLi, HXie, HXu, YTan, SKuang, DDing, JQian, X Acenaphtho[1,2-b]pyrrole-based selective fibroblast growth factor receptors 1 (FGFR1) inhibitors: design, synthesis, and biological activity. J Med Chem 54:3732-45 (2011)  
Target
Name:
Vascular endothelial growth factor receptor 2
Synonyms:
CD_antigen=CD309 Fetal liver kinase 1 (FLK-1) KDR Protein-tyrosine kinase receptor Flk-1 VEGFR-2 VEGFR2 Vascular Endothelial Growth Factor Receptor Kinase 2 Vascular endothelial growth factor receptor 2 (KDR) Vascular endothelial growth factor receptor 2 (VEGFR2) Vascular endothelial growth factor receptor-2 (VEGFR-2)
Type:
Receptor Tyrosine Kinase
Mol. Mass.:
151510.97
Organism:
Homo sapiens (Human)
Description:
P35968
Residue:
1356
  
Inhibitor
Name:
BDBM50345444
Synonyms:
CHEMBL1784725 | Ethyl 8-oxo-8H-acenaphtho[1,2-b]pyrrole-9-carboxylate
Type:
Small organic molecule
Emp. Form.:
C17H11NO3
Mol. Mass.:
277.2741
SMILES:
CCOC(=O)c1c2c3cccc4cccc(c2nc1=O)c34
: