Target
Fibroblast growth factor receptor 1
Ligand
BDBM4882
Substrate
Meas. Tech.
ChEMBL_751986 (CHEMBL1785928)
IC50
334±n/a nM
Citation
 Chen, ZWang, XZhu, WCao, XTong, LLi, HXie, HXu, YTan, SKuang, DDing, JQian, X Acenaphtho[1,2-b]pyrrole-based selective fibroblast growth factor receptors 1 (FGFR1) inhibitors: design, synthesis, and biological activity. J Med Chem 54:3732-45 (2011)  
Target
Name:
Fibroblast growth factor receptor 1
Synonyms:
BFGFR Basic fibroblast growth factor receptor 1 (FGFR1) CEK FGFR-1 FGFR-1, (FL) FGFR1_HUMAN FLT2 Fibroblast growth factor receptor 1 (FGFR-1) Fms-like tyrosine kinase 2 N-sam bFGF-R | c-fgr
Type:
Receptor
Mol. Mass.:
91861.70
Organism:
Homo sapiens (Human)
Description:
P11362
Residue:
822
  
Inhibitor
Name:
BDBM4882
Synonyms:
(Z)-3-[(3-(2-Carboxyethyl)-4-methylpyrrol-2-yl)methylidenyl]indolin-2-one CHEMBL89363 SU5402
Type:
Small organic molecule
Emp. Form.:
C17H16N2O3
Mol. Mass.:
296.3205
SMILES:
Cc1c[nH]c(\C=C2/C(=O)Nc3ccccc23)c1CCC(O)=O
: