Target
Matrix metalloproteinase-14
Ligand
BDBM50345518
Substrate
Meas. Tech.
ChEMBL_751103 (CHEMBL1787040)
IC50
>10000±n/a nM
Citation
 De Savi, CPape, ASawyer, YMilne, DDavies, CCumming, JGTing, ALamont, SSmith, PDTart, JPage, KMoore, P Orally active achiral N-hydroxyformamide inhibitors of ADAM-TS4 (aggrecanase-1) and ADAM-TS5 (aggrecanase-2) for the treatment of osteoarthritis. Bioorg Med Chem Lett 21:3301-6 (2011)  
Target
Name:
Matrix metalloproteinase-14
Synonyms:
MMP-14 MMP14 MT-MMP 1 MT1MMP Matrix Metalloproteinase-14 (MMP-14) Matrix metalloproteinase-14 Membrane-type matrix metalloproteinase 1 | Membrane-type-1 matrix metalloproteinase
Type:
Protein
Mol. Mass.:
65900.19
Organism:
Homo sapiens (Human)
Description:
P50281
Residue:
582
  
Inhibitor
Name:
BDBM50345518
Synonyms:
CHEMBL1784343 US10322143, Compound 14c
Type:
Small organic molecule
Emp. Form.:
C18H29N3O5S
Mol. Mass.:
399.505
SMILES:
Cc1noc(C)c1CCC1CCN(CC1)S(=O)(=O)CC1(CCC1)N(O)C=O
: