Target
72 kDa type IV collagenase
Ligand
BDBM50345518
Substrate
Meas. Tech.
ChEMBL_751107 (CHEMBL1787044)
IC50
>10000±n/a nM
Citation
 De Savi, CPape, ASawyer, YMilne, DDavies, CCumming, JGTing, ALamont, SSmith, PDTart, JPage, KMoore, P Orally active achiral N-hydroxyformamide inhibitors of ADAM-TS4 (aggrecanase-1) and ADAM-TS5 (aggrecanase-2) for the treatment of osteoarthritis. Bioorg Med Chem Lett 21:3301-6 (2011)  
Target
Name:
72 kDa type IV collagenase
Synonyms:
72 kDa gelatinase CLG4A Gelatinase A (MMP-2) MMP2_HUMAN Matrix metalloproteinase-2 (MMP 2) Matrix metalloproteinases 2 (MMP-2) | TBE-1
Type:
Enzyme
Mol. Mass.:
73870.36
Organism:
Homo sapiens (Human)
Description:
P08253
Residue:
660
  
Inhibitor
Name:
BDBM50345518
Synonyms:
CHEMBL1784343 US10322143, Compound 14c
Type:
Small organic molecule
Emp. Form.:
C18H29N3O5S
Mol. Mass.:
399.505
SMILES:
Cc1noc(C)c1CCC1CCN(CC1)S(=O)(=O)CC1(CCC1)N(O)C=O
: