Target
Metabotropic glutamate receptor 5
Ligand
BDBM50345558
Substrate
Meas. Tech.
ChEMBL_751567 (CHEMBL1787493)
Ki
0.69±n/a nM
Citation
 Alagille, DDaCosta, HChen, YHemstapat, KRodriguez, ABaldwin, RMConn, JPTamagnan, GD Potent mGluR5 antagonists: pyridyl and thiazolyl-ethynyl-3,5-disubstituted-phenyl series. Bioorg Med Chem Lett 21:3243-7 (2011)  
Target
Name:
Metabotropic glutamate receptor 5
Synonyms:
GRM5_RAT Grm5 Mglur5 metabotropic glutamate 5/1-C metabotropic glutamate 5a
Type:
Enzyme
Mol. Mass.:
131900.14
Organism:
Rattus norvegicus (Rat)
Description:
P31424
Residue:
1203
  
Inhibitor
Name:
BDBM50345558
Synonyms:
3-(2-(2-methylthiazol-4-yl)ethynyl)-1,5-dibromobenzene | CHEMBL1784604
Type:
Small organic molecule
Emp. Form.:
C12H7Br2NS
Mol. Mass.:
357.064
SMILES:
Cc1nc(cs1)C#Cc1cc(Br)cc(Br)c1
: