Target
Extracellular calcium-sensing receptor
Ligand
BDBM50346032
Substrate
Meas. Tech.
ChEMBL_750427 (CHEMBL1785979)
IC50
18±n/a nM
Citation
 Balan, GBauman, JBhattacharya, SCastrodad, MHealy, DRHerr, MHumphries, PJennings, SKalgutkar, ASKapinos, BKhot, VLazarra, KLi, MLi, YNeagu, COliver, RPiotrowski, DWPrice, DQi, HSimmons, HASouthers, JWei, LZhang, YParalkar, VM The discovery of novel calcium sensing receptor negative allosteric modulators. Bioorg Med Chem Lett 19:3328-32 (2009)  
Target
Name:
Extracellular calcium-sensing receptor
Synonyms:
CASR CaR Calcium-sensing receptor (CaSR) GPRC2A Parathyroid Cell calcium-sensing receptor Synonyms=GPRC2A | hCasR
Type:
Protein
Mol. Mass.:
120663.13
Organism:
Homo sapiens (Human)
Description:
P41180
Residue:
1078
  
Inhibitor
Name:
BDBM50346032
Synonyms:
6-[2-((R)-1-{(R)-3-[2-(3-Chloro-4-methyl-phenyl)-1,1-dimethyl-ethylamino]-2-hydroxy-propoxy}-ethyl)-phenyl]-tricyclo[3.2.1.0*2,4*]octane-3-carboxylic acid | CHEMBL1783935
Type:
Small organic molecule
Emp. Form.:
C31H40ClNO4
Mol. Mass.:
526.107
SMILES:
C[C@@H](OC[C@H](O)CNC(C)(C)Cc1ccc(C)c(Cl)c1)c1ccccc1C1CC2CC1C1C2C1C(O)=O
: