Target
Extracellular calcium-sensing receptor
Ligand
BDBM50318873
Substrate
Meas. Tech.
ChEMBL_750427 (CHEMBL1785979)
IC50
25±n/a nM
Citation
 Balan, GBauman, JBhattacharya, SCastrodad, MHealy, DRHerr, MHumphries, PJennings, SKalgutkar, ASKapinos, BKhot, VLazarra, KLi, MLi, YNeagu, COliver, RPiotrowski, DWPrice, DQi, HSimmons, HASouthers, JWei, LZhang, YParalkar, VM The discovery of novel calcium sensing receptor negative allosteric modulators. Bioorg Med Chem Lett 19:3328-32 (2009)  
Target
Name:
Extracellular calcium-sensing receptor
Synonyms:
CASR CaR Calcium-sensing receptor (CaSR) GPRC2A Parathyroid Cell calcium-sensing receptor Synonyms=GPRC2A | hCasR
Type:
Protein
Mol. Mass.:
120663.13
Organism:
Homo sapiens (Human)
Description:
P41180
Residue:
1078
  
Inhibitor
Name:
BDBM50318873
Synonyms:
(1S,2S,3R,4R,5S)-6-{2-[(1R)-1-[(2R)-3-{[1-(3-fluoro-4-methylphenyl)-2-methylpropan-2-yl]amino}-2-hydroxypropoxy]ethyl]phenyl}tricyclo[3.2.1.0^{2,4}]octane-3-carboxylic acid | CHEMBL1084156
Type:
Small organic molecule
Emp. Form.:
C31H40FNO4
Mol. Mass.:
509.652
SMILES:
C[C@@H](OC[C@H](O)CNC(C)(C)Cc1ccc(C)c(F)c1)c1ccccc1C1C[C@@H]2C[C@H]1[C@@H]1[C@H]2[C@H]1C(O)=O
: