Target
Extracellular calcium-sensing receptor
Ligand
BDBM50346036
Substrate
Meas. Tech.
ChEMBL_750427 (CHEMBL1785979)
IC50
146±n/a nM
Citation
 Balan, GBauman, JBhattacharya, SCastrodad, MHealy, DRHerr, MHumphries, PJennings, SKalgutkar, ASKapinos, BKhot, VLazarra, KLi, MLi, YNeagu, COliver, RPiotrowski, DWPrice, DQi, HSimmons, HASouthers, JWei, LZhang, YParalkar, VM The discovery of novel calcium sensing receptor negative allosteric modulators. Bioorg Med Chem Lett 19:3328-32 (2009)  
Target
Name:
Extracellular calcium-sensing receptor
Synonyms:
CASR CaR Calcium-sensing receptor (CaSR) GPRC2A Parathyroid Cell calcium-sensing receptor Synonyms=GPRC2A | hCasR
Type:
Protein
Mol. Mass.:
120663.13
Organism:
Homo sapiens (Human)
Description:
P41180
Residue:
1078
  
Inhibitor
Name:
BDBM50346036
Synonyms:
CHEMBL1198855 | Ronacaleret
Type:
Small organic molecule
Emp. Form.:
C25H31F2NO4
Mol. Mass.:
447.5147
SMILES:
CC(C)(CC1Cc2ccccc2C1)NC[C@@H](O)COc1cc(CCC(O)=O)cc(F)c1F
: