Target
Extracellular calcium-sensing receptor
Ligand
BDBM50346040
Substrate
Meas. Tech.
ChEMBL_750427 (CHEMBL1785979)
IC50
3500±n/a nM
Citation
 Balan, GBauman, JBhattacharya, SCastrodad, MHealy, DRHerr, MHumphries, PJennings, SKalgutkar, ASKapinos, BKhot, VLazarra, KLi, MLi, YNeagu, COliver, RPiotrowski, DWPrice, DQi, HSimmons, HASouthers, JWei, LZhang, YParalkar, VM The discovery of novel calcium sensing receptor negative allosteric modulators. Bioorg Med Chem Lett 19:3328-32 (2009)  
Target
Name:
Extracellular calcium-sensing receptor
Synonyms:
CASR CaR Calcium-sensing receptor (CaSR) GPRC2A Parathyroid Cell calcium-sensing receptor Synonyms=GPRC2A | hCasR
Type:
Protein
Mol. Mass.:
120663.13
Organism:
Homo sapiens (Human)
Description:
P41180
Residue:
1078
  
Inhibitor
Name:
BDBM50346040
Synonyms:
6-(3-{(R)-3-[2-(3-Fluoro-4-methyl-phenyl)-1,1-dimethyl-ethylamino]-2-hydroxy-propoxy}-phenyl)-tricyclo[3.2.1.0*2,4*]octane-3-carboxylic acid | CHEMBL1783765
Type:
Small organic molecule
Emp. Form.:
C29H36FNO4
Mol. Mass.:
481.5988
SMILES:
Cc1ccc(CC(C)(C)NC[C@@H](O)COc2cccc(c2)C2CC3CC2C2C3C2C(O)=O)cc1F
: