Target
Extracellular calcium-sensing receptor
Ligand
BDBM50346041
Substrate
Meas. Tech.
ChEMBL_750427 (CHEMBL1785979)
IC50
3500±n/a nM
Citation
 Balan, GBauman, JBhattacharya, SCastrodad, MHealy, DRHerr, MHumphries, PJennings, SKalgutkar, ASKapinos, BKhot, VLazarra, KLi, MLi, YNeagu, COliver, RPiotrowski, DWPrice, DQi, HSimmons, HASouthers, JWei, LZhang, YParalkar, VM The discovery of novel calcium sensing receptor negative allosteric modulators. Bioorg Med Chem Lett 19:3328-32 (2009)  
Target
Name:
Extracellular calcium-sensing receptor
Synonyms:
CASR CaR Calcium-sensing receptor (CaSR) GPRC2A Parathyroid Cell calcium-sensing receptor Synonyms=GPRC2A | hCasR
Type:
Protein
Mol. Mass.:
120663.13
Organism:
Homo sapiens (Human)
Description:
P41180
Residue:
1078
  
Inhibitor
Name:
BDBM50346041
Synonyms:
6-(2-{(R)-1-[(R)-2-Hydroxy-3-(2-indan-2-yl-1,1-dimethyl-ethylamino)-propoxy]-ethyl}-phenyl)-tricyclo[3.2.1.0*2,4*]octane-3-carboxylic acid | CHEMBL1783936
Type:
Small organic molecule
Emp. Form.:
C33H43NO4
Mol. Mass.:
517.6988
SMILES:
C[C@@H](OC[C@H](O)CNC(C)(C)CC1Cc2ccccc2C1)c1ccccc1C1CC2CC1C1C2C1C(O)=O
: