Target
C-C chemokine receptor type 2
Ligand
BDBM50346294
Substrate
Meas. Tech.
ChEMBL_750494 (CHEMBL1786158)
IC50
4.5±n/a nM
Citation
 Hughes, RORogier, DJDevraj, RZheng, CCao, GFeng, HXia, MAnand, RXing, LGlenn, JZhang, KCovington, MMorton, PAHutzler, JMDavis, JWScherle, PBaribaud, FBahinski, AMo, ZLNewton, RMetcalf, BXue, CB Discovery of ((1S,3R)-1-isopropyl-3-((3S,4S)-3-methoxy-tetrahydro-2H-pyran-4-ylamino)cyclopentyl)(4-(5-(trifluoromethyl)pyridazin-3-yl)piperazin-1-yl)methanone, PF-4254196, a CCR2 antagonist with an improved cardiovascular profile. Bioorg Med Chem Lett 21:2626-30 (2011)  
Target
Name:
C-C chemokine receptor type 2
Synonyms:
C-C chemokine receptor type 2 (CCR2) CCR2_HUMAN Chemoattractant Cytokine Receptor 2 (CCR2) Monocyte chemotactic protein-1 (MCP-1)
Type:
Enzyme
Mol. Mass.:
41932.32
Organism:
Homo sapiens (Human)
Description:
P41597
Residue:
374
  
Inhibitor
Name:
BDBM50346294
Synonyms:
CHEMBL1782377 | cis-((1S,3R)-1-isopropyl-3-(((3S,4S)-3-methoxytetrahydro-2H-pyran-4-yl)(methyl)amino)cyclopentyl)(4-(4-(trifluoromethyl)pyridin-2-yl)piperazin-1-yl)methanone
Type:
Small organic molecule
Emp. Form.:
C26H39F3N4O3
Mol. Mass.:
512.6081
SMILES:
CO[C@@H]1COCC[C@@H]1N(C)[C@@H]1CC[C@](C1)(C(C)C)C(=O)N1CCN(CC1)c1cc(ccn1)C(F)(F)F
: