Target
Toll-like receptor 7
Ligand
BDBM50346941
Substrate
Meas. Tech.
ChEMBL_753083 (CHEMBL1799011)
IC50
21630±n/a nM
Citation
 Shukla, NMMalladi, SSDay, VDavid, SA Preliminary evaluation of a 3H imidazoquinoline library as dual TLR7/TLR8 antagonists. Bioorg Med Chem 19:3801-11 (2011)  
Target
Name:
Toll-like receptor 7
Synonyms:
ORF Names:UNQ248/PRO285 TLR7_HUMAN | Toll-like receptor 7 (TLR7)
Type:
Enzyme
Mol. Mass.:
120945.35
Organism:
Homo sapiens (Human)
Description:
Q9NYK1
Residue:
1049
  
Inhibitor
Name:
BDBM50346941
Synonyms:
CHEMBL1795699
Type:
Small organic molecule
Emp. Form.:
C17H13N3
Mol. Mass.:
259.3052
SMILES:
Cn1c(nc2c1cnc1ccccc21)-c1ccccc1
: