Target
Cytochrome P450 2C19
Ligand
BDBM50347387
Substrate
Meas. Tech.
ChEMBL_755385 (CHEMBL1804701)
IC50
10000±n/a nM
Citation
 Moffat, DPatel, SDay, FBelfield, ADonald, ARowlands, MWibawa, JBrotherton, DStimson, LClark, VOwen, JBawden, LBox, GBone, EMortenson, PHardcastle, Avan Meurs, SEccles, SRaynaud, FAherne, W Discovery of 2-(6-{[(6-fluoroquinolin-2-yl)methyl]amino}bicyclo[3.1.0]hex-3-yl)-N-hydroxypyrimidine-5-carboxamide (CHR-3996), a class I selective orally active histone deacetylase inhibitor. J Med Chem 53:8663-78 (2010)  
Target
Name:
Cytochrome P450 2C19
Synonyms:
(R)-limonene 6-monooxygenase (S)-limonene 7-monooxygenase CYP2C19 CYPIIC19 Cytochrome P450 2C19 [I331V] Cytochrome P450-254C Mephenytoin 4-hydroxylase P450-254C
Type:
Enzyme
Mol. Mass.:
55935.47
Organism:
Homo sapiens (Human)
Description:
P33261
Residue:
490
  
Inhibitor
Name:
BDBM50347387
Synonyms:
CHEMBL1801172
Type:
Small organic molecule
Emp. Form.:
C20H19N5O4S
Mol. Mass.:
425.461
SMILES:
ONC(=O)c1cnc(nc1)N1C[C@H]2[C@@H](C1)[C@@H]2NS(=O)(=O)c1ccc2ccccc2c1
: