Target
Histone deacetylase 3
Ligand
BDBM50347384
Substrate
Meas. Tech.
ChEMBL_755405 (CHEMBL1804721)
IC50
10±n/a nM
Citation
 Moffat, DPatel, SDay, FBelfield, ADonald, ARowlands, MWibawa, JBrotherton, DStimson, LClark, VOwen, JBawden, LBox, GBone, EMortenson, PHardcastle, Avan Meurs, SEccles, SRaynaud, FAherne, W Discovery of 2-(6-{[(6-fluoroquinolin-2-yl)methyl]amino}bicyclo[3.1.0]hex-3-yl)-N-hydroxypyrimidine-5-carboxamide (CHR-3996), a class I selective orally active histone deacetylase inhibitor. J Med Chem 53:8663-78 (2010)  
Target
Name:
Histone deacetylase 3
Synonyms:
HD3 HDAC3_HUMAN Human HDAC3 SMAP45
Type:
Enzyme
Mol. Mass.:
48829.55
Organism:
Homo sapiens (Human)
Description:
O15379
Residue:
428
  
Inhibitor
Name:
BDBM50347384
Synonyms:
CHEMBL1801238
Type:
Small organic molecule
Emp. Form.:
C17H18ClN5O2
Mol. Mass.:
359.81
SMILES:
ONC(=O)c1cnc(nc1)N1C[C@H]2[C@@H](C1)[C@@H]2NCc1ccc(Cl)cc1
: