Target
Type-1 angiotensin II receptor
Ligand
BDBM50347568
Substrate
Meas. Tech.
ChEMBL_757048 (CHEMBL1803889)
IC50
8.2±n/a nM
Citation
 Casimiro-Garcia, AFilzen, GFFlynn, DBigge, CFChen, JDavis, JADudley, DAEdmunds, JJEsmaeil, NGeyer, AHeemstra, RJJalaie, MOhren, JFOstroski, REllis, TSchaum, RPStoner, C Discovery of a series of imidazo[4,5-b]pyridines with dual activity at angiotensin II type 1 receptor and peroxisome proliferator-activated receptor-¿. J Med Chem 54:4219-33 (2011)  
Target
Name:
Type-1 angiotensin II receptor
Synonyms:
AGTR1 AGTR1B AT1 AT1BR AT2R1B Angiotensin II receptor Type-1 angiotensin II receptor (AT1)
Type:
Protein
Mol. Mass.:
41080.75
Organism:
Homo sapiens (Human)
Description:
P30556
Residue:
359
  
Inhibitor
Name:
BDBM50347568
Synonyms:
CHEMBL1801735
Type:
Small organic molecule
Emp. Form.:
C27H25N7
Mol. Mass.:
447.5343
SMILES:
Cc1cc(C)c2nc(C3CC3)n([C@H]3CCc4cc(ccc34)-c3ccccc3-c3nnn[nH]3)c2n1
: