Target
Retinol-binding protein 4
Ligand
BDBM50347599
Substrate
Meas. Tech.
ChEMBL_756077 (CHEMBL1804187)
EC50
154±n/a nM
Citation
 Campos-Sandoval, JARedondo, CKinsella, GKPal, AJones, GEyre, GSHirst, SCFindlay, JB Fenretinide derivatives act as disrupters of interactions of serum retinol binding protein (sRBP) with transthyretin and the sRBP receptor. J Med Chem 54:4378-87 (2011)  
Target
Name:
Retinol-binding protein 4
Synonyms:
PRBP RBP RET4_HUMAN Retinol-binding protein 4 (RBP4) | spa binding assay for rbp4
Type:
Protein
Mol. Mass.:
23008.75
Organism:
Homo sapiens (Human)
Description:
P02753
Residue:
201
  
Inhibitor
Name:
BDBM50347599
Synonyms:
CHEMBL1802454
Type:
Small organic molecule
Emp. Form.:
C24H35NO2
Mol. Mass.:
369.5402
SMILES:
C\C(\C=C\C1=C(C)CCCC1(C)C)=C/C=C/C(/C)=C/C(=O)N1CCOCC1
: