Target
Cytochrome P450 1A2
Ligand
BDBM50348421
Substrate
Meas. Tech.
ChEMBL_755265 (CHEMBL1804119)
IC50
>10000±n/a nM
Citation
 Morgan, BPMuci, ALu, PPQian, XTochimoto, TSmith, WWGarard, MKraynack, ECollibee, SSuehiro, ITomasi, AValdez, SCWang, WJiang, HHartman, JRodriguez, HMKawas, RSylvester, SElias, KAGodinez, GLee, KAnderson, RSueoka, SXu, DWang, ZDjordjevic, NMalik, FIMorgans, DJ Discovery of omecamtiv mecarbil the first, selective, small molecule activator of cardiac Myosin. ACS Med Chem Lett 1:472-477 (2010)  
Target
Name:
Cytochrome P450 1A2
Synonyms:
CP1A2_HUMAN CYPIA2 Cytochrome P(3)450 Cytochrome P450 1A2 (CYP1A2) Cytochrome P450-P3
Type:
Enzyme
Mol. Mass.:
58423.38
Organism:
Homo sapiens (Human)
Description:
P05177
Residue:
516
  
Inhibitor
Name:
BDBM50348421
Synonyms:
CHEMBL1800953
Type:
Small organic molecule
Emp. Form.:
C20H24FN5O3
Mol. Mass.:
401.4347
SMILES:
COC(=O)N1CCN(Cc2cc(F)cc(NC(=O)Nc3ccc(C)nc3)c2)CC1
: