Target
MAP kinase-activated protein kinase 2
Ligand
BDBM50348490
Substrate
Meas. Tech.
ChEMBL_754901 (CHEMBL1805885)
IC50
270±n/a nM
Citation
 Revesz, LSchlapbach, AAichholz, RDawson, JFeifel, RHawtin, SLittlewood-Evans, AKoch, GKroemer, MMöbitz, HScheufler, CVelcicky, JHuppertz, C In vivo and in vitro SAR of tetracyclic MAPKAP-K2 (MK2) inhibitors. Part II. Bioorg Med Chem Lett 20:4719-23 (2010)  
Target
Name:
MAP kinase-activated protein kinase 2
Synonyms:
MAP kinase-activated protein kinase 2 (MAPKAPK2) MAP kinase-activated protein kinase 2 (p38/MK2) MAPK-activated protein kinase 2 MAPKAP kinase 2 MAPKAPK2 | MK2
Type:
Serine/threonine-protein kinase
Mol. Mass.:
45579.87
Organism:
Homo sapiens (Human)
Description:
P49137
Residue:
400
  
Inhibitor
Name:
BDBM50348490
Synonyms:
CHEMBL1801297
Type:
Small organic molecule
Emp. Form.:
C20H18N4O2
Mol. Mass.:
346.3825
SMILES:
COc1ccc(cc1)-c1ncc2CCc3c([nH]c4CCNC(=O)c34)-c2n1
: