Target
MAP kinase-activated protein kinase 2
Ligand
BDBM50348541
Substrate
Meas. Tech.
ChEMBL_754999 (CHEMBL1805901)
IC50
32±n/a nM
Citation
 Revesz, LSchlapbach, AAichholz, RFeifel, RHawtin, SHeng, RHiestand, PJahnke, WKoch, GKroemer, MMöbitz, HScheufler, CVelcicky, JHuppertz, C In vivo and in vitro SAR of tetracyclic MAPKAP-K2 (MK2) inhibitors. Part I. Bioorg Med Chem Lett 20:4715-8 (2010)  
Target
Name:
MAP kinase-activated protein kinase 2
Synonyms:
MAP kinase-activated protein kinase 2 (MAPKAPK2) MAP kinase-activated protein kinase 2 (p38/MK2) MAPK-activated protein kinase 2 MAPKAP kinase 2 MAPKAPK2 | MK2
Type:
Serine/threonine-protein kinase
Mol. Mass.:
45579.87
Organism:
Homo sapiens (Human)
Description:
P49137
Residue:
400
  
Inhibitor
Name:
BDBM50348541
Synonyms:
CHEMBL1801380
Type:
Small organic molecule
Emp. Form.:
C25H24N4O3
Mol. Mass.:
428.4831
SMILES:
O=C1NCc2[nH]c3c(ccc4cnc(cc34)-c3cccc(OCCN4CCOCC4)c3)c12
: