Target
Neuropeptide S receptor
Ligand
BDBM50348594
Substrate
Meas. Tech.
ChEMBL_755375 (CHEMBL1804531)
IC50
358±n/a nM
Citation
 Trotter, BWNanda, KKManley, PJUebele, VNCondra, CLGotter, ALMenzel, KHenault, MStocco, RRenger, JJHartman, GDBilodeau, MT Tricyclic imidazole antagonists of the Neuropeptide S Receptor. Bioorg Med Chem Lett 20:4704-8 (2010)  
Target
Name:
Neuropeptide S receptor
Synonyms:
GPR154 NPSR1 PGR14
Type:
PROTEIN
Mol. Mass.:
42692.30
Organism:
Homo sapiens (Human)
Description:
ChEMBL_1276607
Residue:
371
  
Inhibitor
Name:
BDBM50348594
Synonyms:
CHEMBL1801319
Type:
Small organic molecule
Emp. Form.:
C23H17ClN2
Mol. Mass.:
356.847
SMILES:
Clc1ccc(cc1)C1(Cc2ccccc2)c2ccccc2-c2nccn12
: