Target
Cathepsin G
Ligand
BDBM50349190
Substrate
Meas. Tech.
ChEMBL_759675 (CHEMBL1811508)
IC50
>10±n/a nM
Citation
 Lo, HYNemoto, PAKim, JMHao, MHQian, KCFarrow, NAAlbaugh, DRFowler, DMSchneiderman, RDMichael August, EMartin, LHill-Drzewi, MPullen, SSTakahashi, HDe Lombaert, S Benzimidazolone as potent chymase inhibitor: modulation of reactive metabolite formation in the hydrophobic (P1) region. Bioorg Med Chem Lett 21:4533-9 (2011)  
Target
Name:
Cathepsin G
Synonyms:
CATG_HUMAN CTSG
Type:
PROTEIN
Mol. Mass.:
28860.08
Organism:
Homo sapiens (Human)
Description:
ChEMBL_1469016
Residue:
255
  
Inhibitor
Name:
BDBM50349190
Synonyms:
CHEMBL1807641
Type:
Small organic molecule
Emp. Form.:
C22H22ClN3O3
Mol. Mass.:
411.881
SMILES:
Cc1c(C)c2ccc(Cl)c(Cn3c4ccccc4n(CCC(O)=O)c3=O)c2n1C
: