Target
Sodium/glucose cotransporter 1
Ligand
BDBM50349240
Substrate
Meas. Tech.
ChEMBL_759749 (CHEMBL1811698)
IC50
1.8±n/a nM
Citation
 Xu, BFeng, YCheng, HSong, YLv, BWu, YWang, CLi, SXu, MDu, JPeng, KDong, JZhang, WZhang, TZhu, LDing, HSheng, ZWelihinda, ARoberge, JYSeed, BChen, Y C-aryl glucosides substituted at the 4'-position as potent and selective renal sodium-dependent glucose co-transporter 2 (SGLT2) inhibitors for the treatment of type 2 diabetes. Bioorg Med Chem Lett 21:4465-70 (2011)  
Target
Name:
Sodium/glucose cotransporter 1
Synonyms:
High affinity sodium-glucose cotransporter Na(+)/glucose cotransporter 1 SGLT1 Sodium-dependent glucose cotransporter 1 (SGLT1) Sodium/glucose cotransporter 1 (SGLT1) | Solute carrier family 5 member 1
Type:
Protein
Mol. Mass.:
73503.78
Organism:
Homo sapiens (Human)
Description:
P13866
Residue:
664
  
Inhibitor
Name:
BDBM50349240
Synonyms:
CHEMBL1807551
Type:
Small organic molecule
Emp. Form.:
C22H25ClO5
Mol. Mass.:
404.884
SMILES:
OC[C@H]1O[C@H]([C@H](O)[C@@H](O)[C@@H]1O)c1ccc(Cl)c(Cc2ccc(cc2)C2CC2)c1
: