Target
C-X-C chemokine receptor type 3
Ligand
BDBM50349671
Substrate
Meas. Tech.
ChEMBL_760045 (CHEMBL1810321)
IC50
53±n/a nM
Citation
 Thoma, GBaenteli, RLewis, IJones, DKovarik, JStreiff, MBZerwes, HG Special ergolines efficiently inhibit the chemokine receptor CXCR3 in blood. Bioorg Med Chem Lett 21:4745-9 (2011)  
Target
Name:
C-X-C chemokine receptor type 3
Synonyms:
CXCR3_MOUSE Cxcr3
Type:
PROTEIN
Mol. Mass.:
41020.84
Organism:
Mus musculus
Description:
ChEMBL_560734
Residue:
367
  
Inhibitor
Name:
BDBM50349671
Synonyms:
CHEMBL1809037
Type:
Small organic molecule
Emp. Form.:
C31H34N4O4
Mol. Mass.:
526.6261
SMILES:
CC(C)OC(=O)Cn1cc2C[C@H]3N(C[C@@H](C=C3c3cccc1c23)C(=O)N1CCCC1)C(=O)Nc1ccccc1
: