Target
Carbonic anhydrase 9
Ligand
BDBM50349851
Substrate
Meas. Tech.
ChEMBL_760548 (CHEMBL1815533)
Ki
34.8±n/a nM
Citation
 Carta, FGaraj, VMaresca, AWagner, JAvvaru, BSRobbins, AHScozzafava, AMcKenna, RSupuran, CT Sulfonamides incorporating 1,3,5-triazine moieties selectively and potently inhibit carbonic anhydrase transmembrane isoforms IX, XII and XIV over cytosolic isoforms I and II: Solution and X-ray crystallographic studies. Bioorg Med Chem 19:3105-19 (2011)  
Target
Name:
Carbonic anhydrase 9
Synonyms:
CA-IX CAH9_HUMAN Carbonic anhydrase 9 (CA IX) Carbonic anhydrase 9 precursor Carbonic anhydrase IX (CAIX) Carbonic anhydrases; II & IX MN RCC-associated antigen G250
Type:
Enzyme
Mol. Mass.:
49669.03
Organism:
Homo sapiens (Human)
Description:
Catalytic domain of human cloned isozyme was used in the assay
Residue:
459
  
Inhibitor
Name:
BDBM50349851
Synonyms:
CHEMBL1813211
Type:
Small organic molecule
Emp. Form.:
C13H17ClN6O3S
Mol. Mass.:
372.83
SMILES:
NS(=O)(=O)c1ccc(Nc2nc(Cl)nc(NCCCCO)n2)cc1
: