Target
Carbonic anhydrase 1
Ligand
BDBM50349851
Substrate
Meas. Tech.
ChEMBL_760546 (CHEMBL1815531)
Ki
1245±n/a nM
Citation
 Carta, FGaraj, VMaresca, AWagner, JAvvaru, BSRobbins, AHScozzafava, AMcKenna, RSupuran, CT Sulfonamides incorporating 1,3,5-triazine moieties selectively and potently inhibit carbonic anhydrase transmembrane isoforms IX, XII and XIV over cytosolic isoforms I and II: Solution and X-ray crystallographic studies. Bioorg Med Chem 19:3105-19 (2011)  
Target
Name:
Carbonic anhydrase 1
Synonyms:
CA-I CAB Carbonate dehydratase I Carbonic anhydrase 1 (CA I) Carbonic anhydrase 1 (Recombinant CA I) Carbonic anhydrase B Carbonic anhydrase I (CA I) Carbonic anhydrase I (CAI) Carbonic anhydrase isoenzyme I (hCA I) | hCA
Type:
Enzyme
Mol. Mass.:
28873.37
Organism:
Homo sapiens (Human)
Description:
P00915
Residue:
261
  
Inhibitor
Name:
BDBM50349851
Synonyms:
CHEMBL1813211
Type:
Small organic molecule
Emp. Form.:
C13H17ClN6O3S
Mol. Mass.:
372.83
SMILES:
NS(=O)(=O)c1ccc(Nc2nc(Cl)nc(NCCCCO)n2)cc1
: