Target
Multidrug resistance-associated protein 1
Ligand
BDBM50158460
Substrate
Meas. Tech.
ChEMBL_760655 (CHEMBL1815640)
IC50
4000±n/a nM
Citation
 Sirisha, KShekhar, MCUmasankar, KMahendar, PSadanandam, AAchaiah, GReddy, VM Molecular docking studies and in vitro screening of new dihydropyridine derivatives as human MRP1 inhibitors. Bioorg Med Chem 19:3249-54 (2011)  
Target
Name:
Multidrug resistance-associated protein 1
Synonyms:
7.6.2.2 ABCC1 ATP-binding cassette, sub-family C, member 1 isoform 1 LTC4 transporter MRP MRP1_HUMAN
Type:
Mol. Mass.:
171597.72
Organism:
Homo sapiens (Human)
Description:
P33527
Residue:
1531
  
Inhibitor
Name:
BDBM50158460
Synonyms:
(3,5-dibromo-4-hydroxyphenyl)(2-ethyl-1-benzofuran-3-yl)methanone 3,5-dibromo-4-hydroxyphenyl-2-ethyl-3-benzofuranyl ketone CHEMBL388590 US9856239, benzbromarone Uroleap (TN) | cid_2333
Type:
Small organic molecule
Emp. Form.:
C17H12Br2O3
Mol. Mass.:
424.083
SMILES:
CCc1oc2ccccc2c1C(=O)c1cc(Br)c(O)c(Br)c1
: