Target
Histone deacetylase 8
Ligand
BDBM19130
Substrate
Meas. Tech.
ChEMBL_761697 (CHEMBL1816689)
IC50
960±n/a nM
Citation
 Whitehead, LDobler, MRRadetich, BZhu, YAtadja, PWClaiborne, TGrob, JEMcRiner, APancost, MRPatnaik, AShao, WShultz, MTichkule, RTommasi, RAVash, BWang, PStams, T Human HDAC isoform selectivity achieved via exploitation of the acetate release channel with structurally unique small molecule inhibitors. Bioorg Med Chem 19:4626-34 (2011)  
Target
Name:
Histone deacetylase 8
Synonyms:
HD8 HDAC8_HUMAN Histone deacetylase 8 (HDAC-8) | Human HDAC8
Type:
Enzyme
Mol. Mass.:
41749.60
Organism:
Homo sapiens (Human)
Description:
Q9BY41
Residue:
377
  
Inhibitor
Name:
BDBM19130
Synonyms:
(2E,4E,6R)-7-[4-(dimethylamino)phenyl]-N-hydroxy-4,6-dimethyl-7-oxohepta-2,4-dienamide TSA | Trichostatin A (TSA)
Type:
Small organic molecule
Emp. Form.:
C17H22N2O3
Mol. Mass.:
302.3682
SMILES:
CC(C=CC(=O)NO)C=C(C)C(=O)c1ccc(cc1)N(C)C
: