Target
Toll-like receptor 4
Ligand
BDBM50351544
Substrate
Meas. Tech.
ChEMBL_765884 (CHEMBL1827810)
IC50
15600±n/a nM
Citation
 Chavez, SAMartinko, AJLau, CPham, MNCheng, KBevan, DEMollnes, TEYin, H Development ofß-amino alcohol derivatives that inhibit Toll-like receptor 4 mediated inflammatory response as potential antiseptics. J Med Chem 54:4659-69 (2011)  
Target
Name:
Toll-like receptor 4
Synonyms:
CD_antigen=CD284 TLR4_MOUSE Toll-like receptor 4 Toll-like receptor 4/MD-2/CD14
Type:
PROTEIN
Mol. Mass.:
95518.84
Organism:
Mus musculus
Description:
ChEMBL_1496719
Residue:
835
  
Inhibitor
Name:
BDBM50351544
Synonyms:
CHEMBL1821757
Type:
Small organic molecule
Emp. Form.:
C23H27Cl2N3O2
Mol. Mass.:
448.385
SMILES:
CN(C[C@H](O)COc1ccc(Cl)cc1)Cc1c(C)nn(Cc2ccccc2Cl)c1C
: