Target
cAMP and cAMP-inhibited cGMP 3',5'-cyclic phosphodiesterase 10A
Ligand
BDBM50351890
Substrate
Meas. Tech.
ChEMBL_765730 (CHEMBL1827309)
IC50
55±n/a nM
Citation
 Zhang, ZLu, XXu, JRothfuss, JMach, RHTu, Z Synthesis and in vitro evaluation of new analogues as inhibitors for phosphodiesterase 10A. Eur J Med Chem 46:3986-95 (2011)  
Target
Name:
cAMP and cAMP-inhibited cGMP 3',5'-cyclic phosphodiesterase 10A
Synonyms:
3',5'-cyclic phosphodiesterase PDE10A Phosphodiesterase 10 (PDE10) | Phosphodiesterase 10A
Type:
Protein
Mol. Mass.:
88412.52
Organism:
Homo sapiens (Human)
Description:
Q9Y233
Residue:
1055
  
Inhibitor
Name:
BDBM50351890
Synonyms:
CHEMBL1821787
Type:
Small organic molecule
Emp. Form.:
C21H22FNO4
Mol. Mass.:
371.4021
SMILES:
COc1ccc(Cc2nccc3cc(OC)c(OC)cc23)cc1OCCF
: