Target
Potassium voltage-gated channel subfamily H member 2
Ligand
BDBM50246241
Substrate
Meas. Tech.
ChEMBL_766668 (CHEMBL1827362)
IC50
2800±n/a nM
Citation
 Levoin, NLabeeuw, OCalmels, TPoupardin-Olivier, OBerrebi-Bertrand, ILecomte, JMSchwartz, JCCapet, M Novel and highly potent histamine H3 receptor ligands. Part 1: withdrawing of hERG activity. Bioorg Med Chem Lett 21:5378-83 (2011)  
Target
Name:
Potassium voltage-gated channel subfamily H member 2
Synonyms:
1,3-beta-glucan synthase component GLS2 ERG Eag-related protein 1 Ether-a-go-go-related gene (HERG) Ether-a-go-go-related gene potassium channel 1 Ether-a-go-go-related gene potassium channel 1 (hERG1) Ether-a-go-go-related protein 1 H-ERG KCNH2 Potassium voltage-gated channel subfamily H member 2 (hERG) Voltage-gated potassium channel subunit Kv11.1 hERG Potassium Channel 1 | putative potassium channel subunit
Type:
Multi-pass membrane protein
Mol. Mass.:
126672.65
Organism:
Homo sapiens (Human)
Description:
Q12809
Residue:
1159
  
Inhibitor
Name:
BDBM50246241
Synonyms:
3-methyl-2-(4-(3-(piperidin-1-yl)propoxy)phenyl)quinazolin-4(3H)-one | CHEMBL487064
Type:
Small organic molecule
Emp. Form.:
C23H27N3O2
Mol. Mass.:
377.4794
SMILES:
Cn1c(nc2ccccc2c1=O)-c1ccc(OCCCN2CCCCC2)cc1
: